Onto Universidad
type: Ontology
creator: Universidad de Extremadura
date: 10-02-2022
description: OntoUniversidad provee un modelo semántico para identificar y expresar las características de una universidad. La ontología actualmente se encuentra continuamente en fase de desarrollo para adaptarse a las necesidades de representación que necesiten los datos de una universidad. La ontología hace uso de otros vocabularios bien conocidos para complementar la representación del conocimiento. El siguiente gráfico muestra las clases y relaciones más generales de la ontología:
version info: 3.1

adscritoACentro
type: ObjectProperty
domain: Personal
range: Centro
comment: Asignado a este Centro.

adscritoADepartamento
type: ObjectProperty
domain: Personal
range: Departamento
comment: Asignado a este Departamento.

asignadaAArea
type: ObjectProperty
domain: Asignatura
range: AreaConocimiento
comment: Asignación entre una asignatura y un área de conocimiento

asignatura
type: ObjectProperty
domain: AsignaturaTitulacion
range: Asignatura
comment: Cada una de las materias de las que consta una carrera o plan de estudios.

coordinador
type: ObjectProperty
domain: PDI
range: GrupoInvestigacion
comment: Coordinador del grupo de investigación.

directorDepartamento
type: ObjectProperty
domain: Departamento
range: PDI
comment: Director del departamento.

imparteDocenciaEnArea
type: ObjectProperty
domain: PDI
range: AreaConocimiento
comment: Imparte dodencia en Área

impartidaEnCentro
type: ObjectProperty
domain: Titulación
range: Centro
range: Restriction
  on property: impartidaEnCentro
  min qualified cardinality: 1
  on class: Centro
comment: La titulacion es impartida en este centro.

indicadoresTitulacion
type: ObjectProperty
domain: IndicadoresTitulacion
range: Titulación
comment: El conjunto de indicadores hace referencia a esta Titulación.

perteneceAGrupoInvestigacion
type: ObjectProperty
domain: Personal
range: GrupoInvestigacion
comment: Forma parte del grupo de investigación.

secretarioDepartamento
type: ObjectProperty
domain: Departamento
range: PDI
comment: Secretario del departamento.

tieneAreaConocimiento
type: ObjectProperty
domain: Departamento
range: AreaConocimiento
comment: El departamento imparte docencia e investiga en este área de conocimiento.

tieneAsignatura
type: ObjectProperty
domain: Titulación
range: AsignaturaTitulacion
comment: Asignatura del plan de estudios.

tienePublicacion
type: ObjectProperty
domain: Personal
range: Publicacion
comment: Publicación del investigador.

alumnosPrimeraMatricula
type: DatatypeProperty
domain: IndicadoresDemandaUniversitaria
range: int
comment: Total de personas matriculadas en el curso académico de referencia, al menos en una asignatura de cualquier programa conducente a titulaciones oficiales.

campusUniversitario
type: DatatypeProperty
domain: Centro
range: string
comment: Campus universitario al que pertenece el centro.

caracterAsignatura
type: DatatypeProperty
domain: AsignaturaTitulacion
range: string
comment: Naturaleza de la asignatura. Pueder ser: obligatoria, optativa, practicas externas, trabajo fin de master, trabajo fin de grado, complemento de formacion o formacion basica.

categoriaPAS
type: DatatypeProperty
domain: PAS
range: string

categoriaPDI
type: DatatypeProperty
domain: PDI
range: string

cohorteAlumnosNuevoIngreso
type: DatatypeProperty
domain: IndicadoresResultadosAcademicos
range: int
comment: Conjunto de alumnos de nuevo ingreso.

cursoAcademico
type: DatatypeProperty
domain: IndicadoresTitulacion
range: string
comment: Año con el que se corresponden estos indicadores.

cursoExtincion
type: DatatypeProperty
domain: Titulación
range: string
comment: Curso de extinción del plan de estudios.

cursoInicio
type: DatatypeProperty
domain: Titulación
range: string
comment: Curso de inicio del plan de estudios.

cursoInicioExtincion
type: DatatypeProperty
domain: Titulación
range: string
comment: Curso de inicio de la extinción del plan de estudios.

dedicacionPDI
type: DatatypeProperty
domain: PDI
range: string

extensionTelefonica
type: DatatypeProperty
domain: Personal
range: int
comment: Extensión telefónica

extranjerosPrimeraMatricula
type: DatatypeProperty
domain: IndicadoresDemandaUniversitaria
range: int
comment: Total de personas de nacionalidad no española matriculadas en el curso académico de referencia, al menos en una asignatura de cualquier programa conducente a titulaciones oficiales.

fechaConcesion
type: DatatypeProperty
domain: DerechoPropiedadIndustrial
domain: Patent
range: dateTime
comment: Fecha de concesión de los derechos de propiedad industrial. La concesión y la publicación de que el expediente está a disposición del público se publicará en el Boletín Oficial de la Propiedad Industrial.

fechaPublicacion
type: DatatypeProperty
domain: DerechoPropiedadIndustrial
domain: Patent
range: dateTime
comment: Fecha de publicación de la solicitud y del informe sobre el estado de la técnica.

fechaSolicitud
type: DatatypeProperty
domain: DerechoPropiedadIndustrial
domain: Patent
range: dateTime
comment: Otorgamiento de la fecha de presentación y admisión a trámite.

hombresMatriculados
type: DatatypeProperty
domain: IndicadoresProcesoAcademico
range: int
comment: Total de personas de género masculino matriculadas, en el curso académico de referencia, al menos en una asignatura de cualquier programa conducente a titulaciones oficiales.

hombresPrimeraMatricula
type: DatatypeProperty
domain: IndicadoresDemandaUniversitaria
range: int
comment: Personas de género masculino que se matriculanen un determinado plan de estudios de la Universidad de Extremadura por primera vez.

hombresPrimeraMatriculaPrimerCurso
type: DatatypeProperty
domain: IndicadoresDemandaUniversitaria
range: int
comment: Personas de género masculino que, en el curso académico de referencia, se matriculan en el primer curso de un determinado plan de estudios de la Universidad de Extremadura, una vez admitidas en el proceso de preinscripción.

indiceHscopus
type: DatatypeProperty
domain: PDI
range: int
comment: ÍndiceH de Scopus

materiaAsignatura
type: DatatypeProperty
domain: AsignaturaTitulacion
range: string
comment: Conjunto de conocimientos científicos que constituyen la asignatura.

moduloAsignatura
type: DatatypeProperty
domain: AsignaturaTitulacion
comment: Unidad educativa que forma parte del programa de la materia de la asignatura.

mujeresMatriculadas
type: DatatypeProperty
domain: IndicadoresProcesoAcademico
range: int
comment: Total de personas de género femenino matriculadas, en el curso académico de referencia, al menos en una asignatura de cualquier programa conducente a titulaciones oficiales.

mujeresPrimeraMatricula
type: DatatypeProperty
domain: IndicadoresDemandaUniversitaria
range: int
comment: Personas de género femenino que se matriculan en un determinado plan de estudios de la Universidad de Extremadura por primera vez.

mujeresPrimeraMatriculaPrimerCurso
type: DatatypeProperty
domain: IndicadoresDemandaUniversitaria
range: int
comment: Personas de género femenino que, en el curso académico de referencia, se matriculan en el primer curso de un determinado plan de estudios de la Universidad de Extremadura, una vez admitidas en el proceso de preinscripción.

notaMinimaAccesoDeportistas
type: DatatypeProperty
domain: IndicadoresDemandaUniversitaria
range: decimal
comment: Nota mínima de acceso para deportistas de alto nivel. Fijada por la nota del último estudiante en primera matricula que cumple estas características.

notaMinimaAccesoDiscapacitados
type: DatatypeProperty
domain: IndicadoresDemandaUniversitaria
range: decimal
comment: Nota mínima de acceso para estudiantes con discapacidad. Fijada por la nota del último estudiante en primera matricula que cumple estas características.

notaMinimaAccesoGeneral
type: DatatypeProperty
domain: IndicadoresDemandaUniversitaria
range: decimal
comment: Nota mínima de acceso del último estudiante que se ha matriculado en un plan de estudios determinado.

notaMinimaAccesoMayor25
type: DatatypeProperty
domain: IndicadoresDemandaUniversitaria
range: decimal
comment: Nota mínima de acceso del último estudiante mayor de 25 años que accede a través de la prueba de acceso para mayores de 25 años y que se ha matriculado en un plan de estudios determinado.

notaMinimaAccesoMayor40
type: DatatypeProperty
domain: IndicadoresDemandaUniversitaria
range: decimal
comment: Nota mínima de acceso del último estudiante mayor de 40 años que accede a una determinada titulación con experiencia laboral o profesional relacionada con la misma.

notaMinimaAccesoMayor45
type: DatatypeProperty
domain: IndicadoresDemandaUniversitaria
range: decimal
comment: Nota mínima de acceso del último estudiante mayor de 45 años que accede a través de la prueba de acceso para mayores de 45 años y que se ha matriculado en un plan de estudios determinado.

notaMinimaAccesoTitulados
type: DatatypeProperty
domain: IndicadoresDemandaUniversitaria
range: decimal
comment: Nota mínima de acceso para estudiantes en posesion de un título universitario oficial. Fijada por la nota del último estudiante en primera matricula que cumple estas características.

numeroAbandonosPrimerCurso
type: DatatypeProperty
domain: IndicadoresResultadosAcademicos
range: int
comment: Número de estudiantes de una cohorte de nuevo ingreso en el primer curso, que sin haberse graduado en ese título no se han matriculado en él durante dos cursos seguidos (durante un curso en el caso de máster).

numeroAbandonosSegundoCurso
type: DatatypeProperty
domain: IndicadoresResultadosAcademicos
range: int
comment: Número de estudiantes de una cohorte de nuevo ingreso en el segundo curso, que sin haberse graduado en ese título no se han matriculado en él durante dos cursos seguidos (durante un curso en el caso de máster).

numeroAbandonosTercerCurso
type: DatatypeProperty
domain: IndicadoresResultadosAcademicos
range: int
comment: Número de estudiantes de una cohorte de nuevo ingreso en el tercer curso, que sin haberse graduado en ese título no se han matriculado en él durante dos cursos seguidos (durante un curso en el caso de máster).

numeroMatriculados
type: DatatypeProperty
domain: AsignaturaTitulacion
range: int
comment: Número de matriculados de la asignatura.

orcidURL
type: DatatypeProperty
domain: Personal
range: anyURI
comment: Enlace ORCID del investigador.

personalActual
type: DatatypeProperty
domain: Personal
range: boolean
comment: Indicador que determina si el personal forma parte actualmente de la plantilla de la Universidad o no.

ratioAlumnoProfesor
type: DatatypeProperty
domain: IndicadoresProcesoAcademico
range: decimal
comment: Número de alumnos por profesor en cada titulación.

satisfaccionConPDI
type: DatatypeProperty
domain: IndicadoresSatisfaccionUsuarios
range: decimal
comment: Indicador que recoge la media de satisfacción percibida por los estudiantes sobre el personal docente e investigador de la universidad.

satisfaccionEgresados
type: DatatypeProperty
domain: IndicadoresSatisfaccionUsuarios
range: decimal
comment: Indicador que recoge la media de satisfacción percibida por los egresados de la titulación cursada, una vez transcurridos tres cursos académicos desde que finalizaron los estudios.

satisfaccionEstudiantes
type: DatatypeProperty
domain: IndicadoresSatisfaccionUsuarios
range: decimal
comment: Indicador que recoge la media de satisfacción percibida por los estudiantes de último curso de la titulación.

satisfaccionPDI
type: DatatypeProperty
domain: IndicadoresSatisfaccionUsuarios
range: decimal
comment: Indicador que recoge la media de satisfacción percibida por el personal docente e investigador de la titulación.

solicitanteDerechoPropiedadIndustrial
type: DatatypeProperty
domain: DerechoPropiedadIndustrial
domain: Patent
range: string
comment: Identidad del solicitante.

tasaAbandono
type: DatatypeProperty
domain: IndicadoresResultadosAcademicos
range: decimal
comment: Relacion porcentual entre el numero total de alumnos de una cohorte de nuevo ingreso en primer curso que debieron finalizar la titulacion en el curso anterior y que no se han matriculado en los dos ultimos cursos.

tasaAbandonoPrimerCurso
type: DatatypeProperty
domain: IndicadoresResultadosAcademicos
range: decimal
comment: Porcentaje de estudiantes de una cohorte de nuevo ingreso en el primer curso, que sin haberse graduado en ese título no se han matriculado en él durante dos cursos seguidos (durante un curso en el caso de máster).

tasaAbandonoSegundoCurso
type: DatatypeProperty
domain: IndicadoresResultadosAcademicos
range: decimal
comment: Porcentaje de estudiantes de una cohorte de nuevo ingreso en el segundo curso, que sin haberse graduado en ese título no se han matriculado en él durante dos cursos seguidos (durante un curso en el caso de máster).

tasaAbandonoTercerCurso
type: DatatypeProperty
domain: IndicadoresResultadosAcademicos
range: decimal
comment: Porcentaje de estudiantes de una cohorte de nuevo ingreso en el tercer curso, que sin haberse graduado en ese título no se han matriculado en él durante dos cursos seguidos (durante un curso en el caso de máster).

tasaEficiencia
type: DatatypeProperty
domain: IndicadoresResultadosAcademicos
range: decimal
comment: Relación porcentual entre el número total de créditos del Plan de estudios a los que debieron haberse matriculado a lo largo de sus estudios el conjunto de graduados del curso académico evaluado y el número de créditos en los que realmente han tenido que matricularse.

tasaExito
type: DatatypeProperty
domain: IndicadoresResultadosAcademicos
range: decimal
comment: Relación porcentual entre el número total de créditos aprobados durante el curso académico bajo estudio por los estudiantes en un plan de estudio y el número total de créditos presentados.

tasaGraduacion
type: DatatypeProperty
domain: IndicadoresResultadosAcademicos
range: decimal
comment: Porcentaje de estudiantes que finalizan la enseñanza en el tiempo previsto en el plan de estudios o en un año académico más en relación a su cohorte de entrada.

tasaProgresoNormalizado
type: DatatypeProperty
domain: IndicadoresResultadosAcademicos
range: decimal
comment: Proporción entre el número total de créditos que han aprobado el conjunto de alumnos graduados durante el curso evaluado y el número total de créditos de los que se han matriculado a lo largo de sus planes de estudios.

tasaRendimiento
type: DatatypeProperty
domain: IndicadoresResultadosAcademicos
range: decimal
comment: Relación porcentual entre el número total de créditos aprobados durante el curso académico bajo estudio por los estudiantes en un plan de estudio y el número total de créditos matriculados.

temporalidadAsignatura
type: DatatypeProperty
domain: AsignaturaTitulacion
range: string

tieneBIBTEX
type: DatatypeProperty
domain: Publicacion
range: string
comment: BIBTEX de la publicación.

tieneLineaInvestigacion
type: DatatypeProperty
domain: GrupoInvestigacion
range: string
comment: El grupo trabaja en este eje temático, en el que confluyen actividades de investigación, realizadas por uno o más grupos de investigación, que tengan resultados visibles en su producción académica.

tipoInvento
type: DatatypeProperty
domain: DerechoPropiedadIndustrial
domain: Patent
range: string
comment: Modalidad de Derecho de Propiedad Industrial.

vecesCitado
type: DatatypeProperty
domain: Publicacion
range: int
comment: Número de citas de una publicación

AreaConocimiento
type: Class
comment: Rama o campo de estudio sobre el cuál se realizan la docencia y la investigación.

ArquitecturaTecnica
type: Class
subclass of: Titulación
comment: Titulación universitaria de primer ciclo en la que se adquieren los conocimientos necesarios para llevar a cabo la ejecución de una obra. Plan de estudios antiguo.

Asignatura
type: Class
equivalent class: Course
comment: Una asignatura es cada uno de los programas que componen un plan de estudios.

AsignaturaTitulacion
type: Class
comment: Asignatura de un plan de estudios determinado.

Centro
type: Class
equivalent class: Center
subclass of: Thing
subclass of: SpatialThing
comment: Escuela, facultad, instituto de invesitgación, centro o estructura, que forma parte de una universidad y es necesaria para el desempeño de sus funciones.

Departamento
type: Class
equivalent class: Departament
comment: Unidad administrativa de docencia e investigación, formada por una o varias cátedras de intereses afines.

DerechoPropiedadIndustrial
type: Class
equivalent class: Patent
comment: Derechos en exclusiva sobre determinadas creaciones inmateriales que se protegen como verdaderos derechos de propiedad. En España hay varios tipos: diseños industriales, marcas y nombres comerciales, patentes y modelos de utilidad, topografías de semiconductores.

Diplomatura
type: Class
subclass of: Titulación
comment: Estudio correspondiente al primer ciclo universitario. Plan de estudios antiguo.

Grado
type: Class
subclass of: Titulación
label: Primer ciclo de enseñanzas univeritarias cuya finalidad es la obtención por parte del estudiante de una formación general orientada a la preparación para el ejercicio profesional.

GrupoInvestigacion
type: Class
equivalent class: ResearchGroup
equivalent class: ResearchOrganization
comment: Organización con una función investigadora primaria y cuyos investigadores tienen una trayectoria común determinada por un registro de publicaciones conjuntas. El grupo debe estar definido por su temática de investigación y no necesariamente por su vinculación asistencial o departamental.

IndicadoresDemandaUniversitaria
type: Class
subclass of: IndicadoresTitulacion
comment: Indicadores relativos al acceso y movilidad de los estudiantes.

IndicadoresProcesoAcademico
type: Class
subclass of: IndicadoresTitulacion
comment: Indicadores referidos a los alumnos matriculados y egresados, la oferta de asignaturas y la dedicación lectiva del estudiante.

IndicadoresResultadosAcademicos
type: Class
subclass of: IndicadoresTitulacion
comment: Indicadores que contienen información estadística sobre los resultados académicos en una titulación.

IndicadoresSatisfaccionUsuarios
type: Class
subclass of: IndicadoresTitulacion
comment: Indicadores que recogen la satisfacción percibida por los usuarios de la Universidad con las Titulaciones.

IndicadoresTitulacion
type: Class
subclass of: Thing
comment: Datos estadísticos sobre las Titulaciones de una Universidad en un determinado curso académico.

Ingenieria
type: Class
subclass of: Titulación
comment: Estudio universitario de dos ciclos de duración que se ocupa del estudio y de la aplicación de conocimientos de las diversas ramas de la tecnología. Plan de estudios antiguo.

IngenieriaTecnica
type: Class
subclass of: Titulación
comment: Estudio universitario de un ciclo de duración que se ocupa del estudio y de la aplicación de conocimientos de las diversas ramas de la tecnología. Plan de estudios antiguo.

Licenciatura
type: Class
subclass of: Titulación
comment: Estudio universitario de ciclo largo o dos ciclos de duración. En el segundo ciclo es dónde se selecciona entre diferentes especializaciones, que dan acceso a un tercer ciclo (Doctorado). Plan de estudios antiguo.

Maestro
type: Class
subclass of: Titulación
comment: Estudio universitario que acredita para el ejercicio de la educación formal e institucional de los niños de Educación Infantil, Primaria o Especial en escuelas o colegios. Plan de estudios antiguo.

MasterOficial
type: Class
subclass of: Titulación
label: Segundo ciclo de enseñanzas universitarias al que se accede trás la obtención de un Grado. Estos estudios están orientados a la especialización académica o profesional o bien a promover la iniciación en tareas investigadoras.

PAS
type: Class
subclass of: Personal
comment: Personal de administración y servicios.

PDI
type: Class
subclass of: Personal
comment: Personal docente e investigador.

Personal
type: Class
comment: Trabajor de la Universidad.

Publicacion
type: Class
equivalent class: JournalArticle
comment: Texto que recoge los resultados obtenidos de investigaciones científicas.

Titulación
type: Class
equivalent class: AcademicDegree
comment: Estudio universitario orientado a una determinada rama de conocimiento y cuya superación implica la obtención de un título oficial.